{"text_format":"3","workbook":"xlsx","n_sheets":16,"sheets":["Copyright","Empieza aquí","Introducción","Aspectos técnicos herramienta","Vencimientos","Material relacionado","Datos","Anexo","Anexo 2","F350","Listado completo de archivos","Instructivo","Tablas","1","2","Formulas"],"not_rendered":{"images":29,"macros":1,"external_links":1,"defined_names":16,"comments":4},"read":"whole","date_system":"1900"}

{"sheet":"Copyright","index":0,"n_rows":16,"n_cols":2,"rows_kept":16,"merged":[[1,4,1,7],[3,1,3,7],[4,1,4,7],[5,1,5,7],[6,1,6,7],[7,1,7,7],[9,2,9,6],[10,1,10,7],[11,1,11,7],[15,1,16,9]]}
{"$rows_empty":15}
[null,"https://actualicese.com/plantilla-en-excel-para-diligenciar-el-formulario-350-de-retencion-en-la-fuente-en-2021/"]

{"sheet":"Empieza aquí","index":1,"n_rows":1,"n_cols":1,"rows_kept":1,"merged":[[9,1,9,9],[11,1,11,9],[12,1,12,9],[14,1,14,9],[15,1,15,9],[21,1,21,5],[21,7,21,9],[23,1,23,5],[23,7,24,9],[24,1,24,5],[25,1,26,5],[25,7,27,9],[27,1,28,5],[28,7,28,9],[29,1,30,5],[29,7,29,9],[30,7,30,9]]}
[" "]

{"sheet":"Introducción","index":2,"n_rows":20,"n_cols":1,"rows_kept":20,"merged":[[6,0,6,7],[10,0,10,7],[11,0,11,7],[12,0,12,7],[13,0,13,7],[15,0,15,7],[17,0,17,7],[19,0,19,7],[21,0,21,7],[23,0,23,7],[25,0,25,7],[27,0,27,7],[28,0,28,7],[30,0,30,7],[32,0,32,7],[33,0,33,7],[34,0,34,7],[35,0,35,7]]}
[]
[]
[]
[]
[]
[]
["Plantilla en Excel para diligenciar el formulario 350 de retención en la fuente en 2021"]
[]
["Fecha de elaboración: febrero 23 de 2021"]
[]
["El 24 de noviembre de 2020 se dio a conocer por parte de la Dian un proyecto de resolución"]
["con el cual se pretendía prescribir el formulario 350 para 2021, finalmente, dicho organismo expidió la Resolución 000009 el pasado 5 de febrero de 2021, sin incluir el anexo del formulario; no obstante, la estructura del formulario cargada en la plataforma Muisca correspondía a la expuesta en el proyecto de norma. "]
[]
["Posteriormente, el 17 de febrero de 2021 se dio a conocer el formulario 350 en la zona de formularios e instructivos de la Dian. En este formulario oficial se puede percibir cómo se eliminan los renglones 84 y 85 que se utilizaron para reportar los valores de “Retenciones impuesto solidario COVID-19” y “Aporte solidario por el COVID-19”, generando un cambio en la distribución de los renglones a partir de estos. Dicha información con relación al COVID-19 será reportada por el año gravable 2020 en el formulario 220 (ingresa aquí para conocer nuestra plantilla sobre este formulario)."]
[]
{"$rows_left_out":6}
{"sheet":"Aspectos técnicos herramienta","index":3,"n_rows":82,"n_cols":5,"rows_kept":82,"merged":[[6,0,6,7],[8,0,8,7],[9,0,9,3],[11,0,11,7],[13,0,13,7],[14,0,14,7],[15,0,15,7],[16,0,16,7],[77,0,77,7],[79,0,79,7],[81,0,81,7]]}
[]
[]
[]
[]
[]
[]
["Aspectos técnicos herramienta"]
[]
["En la hoja “Vencimientos” ubicarás el calendario tributario expuesto en el artículo 1.6.1.13.2.33 "]
["del Decreto 1625 de 2016, modificado por el",{"$nulls":3},"artículo 1 del Decreto 1680 de 2020."]
[]
["Si desees conocer el material relacionado que debes estudiar para ampliar tu conocimiento sobre cada ítem del formulario, ingresa a la hoja “Material relacionado”. En dicho material ubicamos enlaces de videos grabados por Diego Guevara Madrid (líder de investigación tributaria), análisis, casos de estudio, conceptos tributarios y guías elaboradas por el equipo editorial de Actualícese. "]
[]
["Podrás ingresar los datos iniciales del declarante y signatario, diligenciando los campos de la hoja “Datos”."]
["En la hoja “Anexo” encontrarás diferentes comentarios emergentes y los campos requeridos para diligenciar la información que irá a cada casilla del formulario. Ten en cuenta que cada casilla expuesta en esta hoja es un botón y que al presionar un clic sobre este permitirá visualizar una ventana emergente en la que alojamos las instrucciones y aspectos clave para diligenciar cada casilla del formulario 350. Aquí encontrarás en cada ventana emergente, en la parte superior el comentario del instructivo y en la parte inferior el comentario de Actualícese."]
{"$rows_left_out":7}
{"sheet":"Vencimientos","index":4,"n_rows":27,"n_cols":13,"rows_kept":27,"merged":[[8,0,8,12],[9,0,9,12],[10,0,10,12],[11,0,11,12],[12,0,14,0],[13,1,13,12],[26,0,27,12]]}
{"$rows_empty":8}
["Retención en la fuente y autorretención del impuesto de renta y complementarios"]
["Declaración y pago mensual 2021"]
["(Artículo 1.6.1.13.2.33 del Decreto 1625 de 2016, modificado por el artículo 1 del Decreto 1680 de 2020)"]
[]
["Último dígito del NIT","Ene","Feb","Mar","Abr","May","Jun","Jul","Ago","Sep","Oct","Nov","Dic"]
[null,"Plazo máximo para consignar en 2021"]
[null,"Feb","Mar","Abr","May","Jun","Jul","Ago","Sep","Oct","Nov","Dic","2022-01-01"]
[1,9,9,12,10,9,8,10,8,7,9,10,12]
[2,10,10,13,11,10,9,11,9,8,10,13,13]
[3,11,11,14,12,11,12,12,10,11,11,14,14]
[4,12,12,15,13,15,13,13,13,12,12,15,17]
[5,15,15,16,14,16,14,17,14,13,16,16,18]
[6,16,16,19,18,17,15,18,15,14,17,17,19]
[7,17,17,20,19,18,16,19,16,15,18,20,20]
{"$rows_left_out":6}
{"sheet":"Material relacionado","index":5,"n_rows":63,"n_cols":1,"rows_kept":63,"merged":[[5,0,7,7],[9,0,9,7],[10,0,10,7],[11,0,11,7],[13,0,13,7],[14,0,14,7],[16,0,16,7],[17,0,17,7],[19,0,19,7],[20,0,20,7],[22,0,22,7],[23,0,23,7],[25,0,25,7],[26,0,26,7],[28,0,28,7],[29,0,29,7],[31,0,31,7],[32,0,32,7],[34,0,34,7],[35,0,35,7],[37,0,37,7],[38,0,38,7],[40,0,40,7],[41,0,41,7],[43,0,43,7],[44,0,44,7],[46,0,46,7],[47,0,47,7],[49,0,49,7],[50,0,50,7],[52,0,52,7],[53,0,53,7],[55,0,55,7],[56,0,56,7],[58,0,58,7],[59,0,59,7],[61,0,61,7],[62,0,62,7]]}
[]
[]
[]
[]
[]
["Material relacionado"]
[]
[]
["Fecha de elaboración: febrero 23 de 2021"]
[]
["[Análisis] Nuevo formulario 350 para retenciones en la fuente de 2021 fue prescrito por la Dian"]
["Mediante su Resolución 000009 de febrero 5 de 2021, la Dian prescribió el formulario 350, empleado por primera vez para declarar las retenciones y autorretenciones de enero de 2021.\n\nEn el nuevo formulario se eliminaron los renglones para reportar retenciones a título del impuesto solidario COVID-19."]
[]
["[Formatos] Formularios e instructivos de la Dian"]
["El Ministerio de Hacienda y la Dian, a través de diversas normas, prescriben los formatos y formularios para que los contribuyentes cumplan con sus respectivas obligaciones tributarias.\n\nEn este apartado relacionaremos las normas más relevantes en materia tributaria, utilizadas para la declaración, reporte y pago de diferentes obligaciones. Asimismo, compartimos sus respectivos formularios en PDF y las versiones disponibles a título de guía (por parte de Actualícese) en formato Excel."]
{"$rows_left_out":49}
{"sheet":"Datos","index":6,"n_rows":37,"n_cols":13,"rows_kept":37,"merged":[[2,1,3,13],[9,1,9,13],[13,2,13,3],[13,5,13,7],[15,2,15,3],[17,2,17,3],[19,2,19,3],[19,5,19,10],[20,2,20,4],[21,5,21,10],[22,2,23,4],[26,1,26,13],[28,1,28,4],[30,1,30,13],[32,2,32,4],[32,5,32,10],[36,2,36,3]]}
[]
[]
[null,"DATOS INICIALES"]
[]
[]
[{"$nulls":3},"1. Año",null,2021]
[]
[{"$nulls":3},"3. Período"]
[]
[null,"DATOS DEL DECLARANTE"]
[]
[{"$nulls":3},"5. NIT",{"$nulls":3},"6. DV",{"$f":"IF(Formulas!A2=0,0,IF(Formulas!A2=1,1,11-Formulas!A2))","v":0}]
[]
[null,null,"Tipo de agente"]
[]
{"$rows_left_out":23}
{"sheet":"Anexo","index":7,"n_rows":204,"n_cols":12,"rows_kept":204,"merged":[[2,5,3,6],[4,2,5,2],[4,4,5,4],[4,5,5,5],[4,6,5,6],[4,7,5,7],[4,8,5,8],[4,9,4,10],[4,11,5,11],[7,2,11,2],[7,4,11,4],[7,5,10,5],[13,2,17,2],[13,4,17,4],[13,5,16,5],[19,2,23,2],[19,4,23,4],[19,5,22,5],[25,2,29,2],[25,4,29,4],[25,5,28,5],[31,2,35,2],[31,4,35,4],[31,5,34,5],[37,2,41,2],[37,4,41,4],[37,5,40,5],[43,2,47,2],[43,4,47,4],[43,5,46,5],[49,2,53,2],[49,4,53,4],[49,5,52,5],[55,2,59,2],[55,4,59,4],[55,5,58,5],[61,2,65,2],[61,4,65,4],[61,5,64,5],[67,2,71,2],[67,4,71,4],[67,5,70,5],[73,2,77,2],[73,4,77,4],[73,5,76,5],[79,2,83,2],[79,4,83,4],[79,5,82,5],[85,2,89,2],[85,4,89,4],[85,5,88,5],[91,2,95,2],[91,4,95,4],[91,5,94,5],[97,4,98,5],[99,2,103,2],[99,4,103,4],[99,5,102,5],[105,2,109,2],[105,4,109,4],[105,5,108,5],[111,2,115,2],[111,4,115,4],[111,5,114,5],[117,2,121,2],[117,4,121,4],[117,5,120,5],[123,2,127,2],[123,4,127,4],[123,5,126,5],[129,2,133,2],[129,4,133,4],[129,5,132,5],[135,2,139,2],[135,4,139,4],[135,5,138,5],[141,2,145,2],[141,4,145,4],[141,5,144,5],[148,2,152,2],[148,4,152,4],[148,5,151,5],[154,2,158,2],[154,4,158,4],[154,5,157,5],[160,2,164,2],[160,4,164,4],[160,5,163,5],[166,4,167,5],[168,2,172,2],[168,4,172,4],[168,5,171,5],[174,2,178,2],[174,4,178,4],[174,5,177,5],[180,2,184,2],[180,4,184,4],[180,5,183,5],[187,2,191,2],[187,4,191,4],[187,5,190,5],[193,2,197,2],[193,4,197,4],[193,5,196,5],[199,2,203,2],[199,4,203,4],[199,5,202,5]]}
[]
[]
[]
[]
[null,null,"Renglón",null,"Renglón","Concepto","Código\ncuenta contable","Nombre del beneficiario del pago o abono en cuenta","NIT","Retención en la fuente a título de renta, IVA, Timbre e INC",null,"Devolución de retenciones de períodos anteriores"]
[{"$nulls":9},"Base sujeta a retención para pagos o abonos en cuenta","Retenciones a título de renta"]
[]
[null,null,27,null,52,"Rentas de trabajo"]
[]
[]
[]
[{"$nulls":5},"SUBTOTAL",{"$nulls":3},{"$f":"SUM(J8:J11)","v":0},{"$f":"SUM(K8:K11)","v":0}]
[]
[null,null,28,null,53,"Rentas de pensiones"]
[]
{"$rows_left_out":190}
{"sheet":"Anexo 2","index":8,"n_rows":67,"n_cols":74,"rows_kept":67,"merged":[[2,1,2,77],[3,1,3,77],[5,1,8,15],[5,16,8,52],[5,53,7,58],[5,59,7,62],[5,63,8,77],[8,53,8,58],[8,59,8,62],[9,1,9,40],[9,57,9,59],[9,61,9,70],[16,5,16,40],[16,49,16,77],[17,2,17,12],[17,13,17,21],[17,22,17,37],[17,38,17,41],[17,42,17,57],[17,58,17,66],[17,67,17,77],[18,2,18,12],[18,13,18,21],[18,22,18,37],[18,38,18,41],[18,42,18,57],[18,58,18,66],[18,67,18,77],[19,2,19,12],[19,13,19,21],[19,22,19,37],[19,38,19,41],[19,42,19,57],[19,58,19,66],[19,67,19,77],[20,2,20,12],[20,13,20,21],[20,22,20,37],[20,38,20,41],[20,42,20,57],[20,58,20,66],[20,67,20,77],[21,2,21,12],[21,13,21,21],[21,22,21,37],[21,38,21,41],[21,42,21,57],[21,58,21,66],[21,67,21,77],[22,2,22,12],[22,13,22,21],[22,22,22,37],[22,38,22,41],[22,42,22,57],[22,58,22,66],[22,67,22,77],[23,2,23,12],[23,13,23,21],[23,22,23,37],[23,38,23,41],[23,42,23,57],[23,58,23,66],[23,67,23,77],[24,2,24,12],[24,13,24,21],[24,22,24,37],[24,38,24,41],[24,42,24,57],[24,58,24,66],[24,67,24,77],[25,2,25,12],[25,13,25,21],[25,22,25,37],[25,38,25,41],[25,42,25,57],[25,58,25,66],[25,67,25,77],[26,2,26,12],[26,13,26,21],[26,22,26,37],[26,38,26,41],[26,42,26,57],[26,58,26,66],[26,67,26,77],[27,2,27,12],[27,13,27,21],[27,22,27,37],[27,38,27,41],[27,42,27,57],[27,58,27,66],[27,67,27,77],[28,2,28,12],[28,13,28,21],[28,22,28,37],[28,38,28,41],[28,42,28,57],[28,58,28,66],[28,67,28,77],[29,2,29,12],[29,13,29,21],[29,22,29,37],[29,38,29,41],[29,42,29,57],[29,58,29,66],[29,67,29,77],[30,2,30,12],[30,13,30,21],[30,22,30,37],[30,38,30,41],[30,42,30,57],[30,58,30,66],[30,67,30,77],[31,2,31,12],[31,13,31,21],[31,22,31,37],[31,38,31,41],[31,42,31,57],[31,58,31,66],[31,67,31,77],[32,2,32,12],[32,13,32,21],[32,22,32,37],[32,38,32,41],[32,42,32,57],[32,58,32,66],[32,67,32,77],[33,2,33,12],[33,13,33,21],[33,22,33,37],[33,38,33,41],[33,42,33,57],[33,58,33,66],[33,67,33,77],[34,2,34,12],[34,13,34,21],[34,22,34,37],[34,38,34,41],[34,42,34,57],[34,58,34,66],[34,67,34,77],[35,2,35,12],[35,13,35,21],[35,22,35,37],[35,38,35,41],[35,42,35,57],[35,58,35,66],[35,67,35,77],[36,2,36,12],[36,13,36,21],[36,22,36,37],[36,38,36,41],[36,42,36,57],[36,58,36,66],[36,67,36,77],[37,2,37,12],[37,13,37,21],[37,22,37,37],[37,38,37,41],[37,42,37,57],[37,58,37,66],[37,67,37,77],[38,2,38,12],[38,13,38,21],[38,22,38,37],[38,38,38,41],[38,42,38,57],[38,58,38,66],[38,67,38,77],[39,2,39,12],[39,13,39,21],[39,22,39,37],[39,38,39,41],[39,42,39,57],[39,58,39,66],[39,67,39,77],[40,2,40,12],[40,13,40,21],[40,22,40,37],[40,38,40,41],[40,42,40,57],[40,58,40,66],[40,67,40,77],[41,2,41,12],[41,13,41,21],[41,22,41,37],[41,38,41,41],[41,42,41,57],[41,58,41,66],[41,67,41,77],[42,2,42,12],[42,13,42,21],[42,22,42,37],[42,38,42,41],[42,42,42,57],[42,58,42,66],[42,67,42,77],[43,2,43,12],[43,13,43,21],[43,22,43,37],[43,38,43,41],[43,42,43,57],[43,58,43,66],[43,67,43,77],[44,2,44,12],[44,13,44,21],[44,22,44,37],[44,38,44,41],[44,42,44,57],[44,58,44,66],[44,67,44,77],[45,2,45,12],[45,13,45,21],[45,22,45,37],[45,38,45,41],[45,42,45,57],[45,58,45,66],[45,67,45,77],[46,2,46,12],[46,13,46,21],[46,22,46,37],[46,38,46,41],[46,42,46,57],[46,58,46,66],[46,67,46,77],[47,2,47,12],[47,13,47,21],[47,22,47,37],[47,38,47,41],[47,42,47,57],[47,58,47,66],[47,67,47,77],[48,2,48,12],[48,13,48,21],[48,22,48,37],[48,38,48,41],[48,42,48,57],[48,58,48,66],[48,67,48,77],[49,2,49,12],[49,13,49,21],[49,22,49,37],[49,38,49,41],[49,42,49,57],[49,58,49,66],[49,67,49,77],[50,2,50,12],[50,13,50,21],[50,22,50,37],[50,38,50,41],[50,42,50,57],[50,58,50,66],[50,67,50,77],[51,2,51,12],[51,13,51,21],[51,22,51,37],[51,38,51,41],[51,42,51,57],[51,58,51,66],[51,67,51,77],[52,2,52,12],[52,13,52,21],[52,22,52,37],[52,38,52,41],[52,42,52,57],[52,58,52,66],[52,67,52,77],[53,2,53,12],[53,13,53,21],[53,22,53,37],[53,38,53,41],[53,42,53,57],[53,58,53,66],[53,67,53,77],[54,2,54,12],[54,13,54,21],[54,22,54,37],[54,38,54,41],[54,42,54,57],[54,58,54,66],[54,67,54,77],[55,2,55,12],[55,13,55,21],[55,22,55,37],[55,38,55,41],[55,42,55,57],[55,58,55,66],[55,67,55,77],[56,2,56,12],[56,13,56,21],[56,22,56,37],[56,38,56,41],[56,42,56,57],[56,58,56,66],[56,67,56,77],[57,2,57,12],[57,13,57,21],[57,22,57,37],[57,38,57,41],[57,42,57,57],[57,58,57,66],[57,67,57,77],[58,2,58,12],[58,13,58,21],[58,22,58,37],[58,38,58,41],[58,42,58,57],[58,58,58,66],[58,67,58,77],[59,2,59,12],[59,13,59,21],[59,22,59,37],[59,38,59,41],[59,42,59,57],[59,58,59,66],[59,67,59,77],[60,2,60,12],[60,13,60,21],[60,22,60,37],[60,38,60,41],[60,42,60,57],[60,58,60,66],[60,67,60,77],[61,2,61,12],[61,13,61,21],[61,22,61,37],[61,38,61,41],[61,42,61,57],[61,58,61,66],[61,67,61,77],[62,2,62,12],[62,13,62,21],[62,22,62,37],[62,38,62,41],[62,42,62,57],[62,58,62,66],[62,67,62,77],[63,2,63,12],[63,13,63,21],[63,22,63,37],[63,38,63,41],[63,42,63,57],[63,58,63,66],[63,67,63,77],[64,2,64,12],[64,13,64,21],[64,22,64,37],[64,38,64,41],[64,42,64,57],[64,58,64,66],[64,67,64,77],[65,2,65,12],[65,13,65,21],[65,22,65,37],[65,38,65,41],[65,42,65,57],[65,58,65,66],[65,67,65,77],[66,2,66,12],[66,13,66,21],[66,22,66,37],[66,38,66,41],[66,42,66,57],[66,58,66,66],[66,67,66,77],[68,1,69,15],[68,16,69,51],[68,53,69,58],[68,59,69,62],[68,63,69,77]]}
[]
[]
[]
[]
[]
[{"$nulls":16},"Declaración de Retenciones en la Fuente "]
[]
[]
[]
[{"$nulls":52},"Página",{"$nulls":7},"de",{"$nulls":12},"Hoja 2"]
[null,"Espacio reservado para la DIAN",{"$nulls":39},"4. Número de formulario"]
[]
[]
[]
[]
{"$rows_left_out":53}
{"sheet":"F350","index":9,"n_rows":62,"n_cols":62,"rows_kept":62,"merged":[[1,11,3,38],[1,39,3,44],[1,45,3,51],[6,17,6,24],[7,2,7,24],[10,1,14,1],[11,17,11,25],[11,26,11,33],[11,34,11,41],[11,42,11,51],[12,17,12,25],[12,26,12,33],[12,34,12,41],[12,42,12,51],[13,48,13,51],[14,2,14,47],[14,48,14,49],[14,50,14,51],[15,1,15,7],[15,9,15,11],[15,12,15,13],[15,15,15,21],[15,22,15,27],[15,28,15,39],[15,40,15,45],[15,46,15,48],[15,49,15,51],[16,1,16,26],[16,27,16,40],[16,41,16,51],[17,1,17,26],[17,28,17,40],[17,42,17,51],[18,1,18,26],[18,28,18,40],[18,42,18,51],[19,1,19,26],[19,28,19,40],[19,42,19,51],[20,1,20,26],[20,28,20,40],[20,42,20,51],[21,1,21,26],[21,28,21,40],[21,42,21,51],[22,1,22,26],[22,28,22,40],[22,42,22,51],[23,1,23,26],[23,28,23,40],[23,42,23,51],[24,1,24,26],[24,28,24,40],[24,42,24,51],[25,1,25,26],[25,28,25,40],[25,42,25,51],[26,1,26,26],[26,28,26,40],[26,42,26,51],[27,1,27,26],[27,28,27,40],[27,42,27,51],[28,1,28,26],[28,28,28,40],[28,42,28,51],[29,1,29,26],[29,28,29,40],[29,42,29,51],[30,1,30,26],[30,28,30,40],[30,42,30,51],[31,1,31,26],[31,28,31,40],[31,42,31,51],[32,1,39,1],[32,2,32,26],[32,28,32,40],[32,42,32,51],[33,2,33,26],[33,28,33,40],[33,42,33,51],[34,2,34,26],[34,28,34,40],[34,42,34,51],[35,2,35,26],[35,28,35,40],[35,42,35,51],[36,2,36,26],[36,28,36,40],[36,42,36,51],[37,2,37,26],[37,28,37,40],[37,42,37,51],[38,2,38,26],[38,28,38,40],[38,42,38,51],[39,2,39,26],[39,28,39,40],[39,42,39,51],[40,1,40,26],[40,28,40,40],[40,42,40,51],[41,1,41,26],[41,28,41,40],[41,42,41,51],[42,1,42,40],[42,42,42,51],[43,1,43,40],[43,42,43,51],[44,1,44,51],[45,1,48,1],[45,2,45,40],[45,42,45,51],[46,2,46,40],[46,42,46,51],[47,2,47,40],[47,42,47,51],[48,2,48,40],[48,42,48,51],[49,1,49,40],[49,42,49,51],[50,1,50,40],[50,42,50,51],[51,1,53,1],[51,2,51,40],[51,42,51,51],[52,2,52,40],[52,42,52,51],[53,2,53,40],[53,42,53,51],[54,1,54,20],[54,21,54,51],[55,16,55,31],[56,16,56,31],[56,32,56,39],[56,41,56,50],[58,32,61,51],[60,16,60,31],[61,1,61,6],[61,9,61,14],[61,16,61,31]]}
[]
[{"$nulls":11},"Declaración Retenciones en la Fuente",{"$nulls":27},"Privada"]
[]
[]
[null,"1. Año",null,null,2,0,2,1,{"$nulls":12},"3. Período",null,null,{"$f":"IFERROR(MID(VLOOKUP(Datos!seleccion,Tablas!I3:J14,2,FALSE),1,1),0)","v":0},{"$f":"IFERROR(MID(VLOOKUP(Datos!seleccion,Tablas!I3:J14,2,FALSE),2,1),0)","v":0},{"$nulls":30},1]
[null,"Espacio reservado para la DIAN",{"$nulls":25},"4. Número de Formulario"]
[]
[]
[]
[]
[null,"Datos del\ndeclarante","5. Número de  Identificación Tributaria (NIT)",{"$nulls":13},"6. DV","7. Primer apellido",{"$nulls":8},"8. Segundo apellido",{"$nulls":7},"9. Primer nombre",{"$nulls":7},"10. Otros nombres"]
[null,null,{"$f":"MID(Datos!$F$12,1,1)","v":""},{"$f":"MID(Datos!$F$12,2,1)","v":""},{"$f":"MID(Datos!$F$12,3,1)","v":""},{"$f":"MID(Datos!$F$12,4,1)","v":""},{"$f":"MID(Datos!$F$12,5,1)","v":""},{"$f":"MID(Datos!$F$12,6,1)","v":""},{"$f":"MID(Datos!$F$12,7,1)","v":""},{"$f":"MID(Datos!$F$12,8,1)","v":""},{"$f":"MID(Datos!$F$12,9,1)","v":""},{"$f":"MID(Datos!$F$12,10,1)","v":""},{"$f":"MID(Datos!$F$12,11,1)","v":""},{"$f":"MID(Datos!$F$12,12,1)","v":""},{"$f":"MID(Datos!$F$12,13,1)","v":""},{"$f":"MID(Datos!$F$12,14,1)","v":""},{"$f":"IF(Datos!I12=0,\"\",Datos!I12)","v":""},{"$f":"IF(Datos!F14=\"Persona natural\",IF(Datos!F16=0,\"\",Datos!F16),\"\")","v":""},{"$nulls":8},{"$f":"IF(Datos!F14=\"Persona natural\",IF(Datos!K16=0,\"\",Datos!K16),\"\")","v":""},{"$nulls":7},{"$f":"IF(Datos!F14=\"Persona natural\",IF(Datos!F18=0,\"\",Datos!F18),\"\")","v":""},{"$nulls":7},{"$f":"IF(Datos!F14=\"Persona natural\",IF(Datos!K18=0,\"\",Datos!K18),\"\")","v":""}]
[]
[null,null,"11.  Razón Social",{"$nulls":45},"12. Cód. Dirección Seccional."]
[null,null,{"$f":"IF(Datos!F14=\"Persona jurídica o sociedad de hecho\",IF(Datos!F20=0,\"\",Datos!F20),\"\")","v":""},{"$nulls":45},{"$f":"MID(Datos!M22,1,1)","v":"0"},null,{"$f":"MID(Datos!M22,2,1)","v":"0"}]
{"$rows_left_out":48}
{"sheet":"Listado completo de archivos","index":10,"n_rows":2494,"n_cols":2,"rows_kept":2494,"merged":[[6,0,6,1]]}
[]
[]
[]
[]
[]
[]
["ESTE ES EL LISTADO COMPLETO DE LAS HERRAMIENTAS PUBLICADAS"]
["Última actualización: 10 de febrero de 2021"]
["Haz clic aquí para ver una versión actualizada de este listado"]
["IDEA:","Si quieres buscar una herramienta en especial en este listado, dale \"Buscar\" en Excel (Ctrl + B, en casi todos lados)."]
[]
[null,"Modelo de acta de distribución de utilidades y pago de dividendos"]
[]
[null,"[Pack de formatos] Formatos para la liquidación de nómina paso a paso"]
[]
{"$rows_left_out":2480}
{"sheet":"Instructivo","index":11,"n_rows":0,"n_cols":0,"rows_kept":0,"hidden":true}

{"sheet":"Tablas","index":12,"n_rows":68,"n_cols":12,"rows_kept":68,"hidden":true,"merged":[[1,8,1,9],[15,2,15,3],[15,8,15,11],[16,8,16,9],[16,10,16,11]]}
[]
[{"$nulls":8},"Periodo"]
[{"$nulls":8},"Enero","01"]
[{"$nulls":8},"Febrero","02"]
[{"$nulls":8},"Marzo","03"]
[{"$nulls":8},"Abril","04"]
[{"$nulls":8},"Mayo","05"]
[{"$nulls":8},"Junio","06"]
[{"$nulls":8},"Julio","07"]
[{"$nulls":8},"Agosto","08"]
[{"$nulls":8},"Septiembre","09"]
[{"$nulls":8},"Octubre",10]
[null,null,"Persona natural",{"$nulls":3},"Código",null,"Noviembre",11]
[null,null,"Persona jurídica o sociedad de hecho",{"$nulls":3},1,null,"Diciembre",12]
[{"$nulls":6},2]
{"$rows_left_out":54}
{"sheet":"1","index":13,"n_rows":22,"n_cols":4,"rows_kept":22,"hidden":true,"merged":[[5,0,8,3],[26,0,26,8],[27,0,27,8]]}
[]
[]
[]
[]
[]
["Material relacionado"]
[]
[]
[]
["Concepto","Cuantía en UVT","Cuantía en pesos","Tarifa"]
["Ingresos originados en una relación laboral o legal y reglamentaria (personas naturales declarantes o no de renta).","> 95 UVT","> 3.449.000","Ver tabla del artículo 383 del ET."]
["Honorarios y compensación de servicios personales por personas naturales que manifiestan que no han subcontratado dos o más personas.","> 95 UVT","> 3.449.000","Ver tabla del artículo 383 del ET."]
["Servicios de aseo y vigilancia (la base será el 100 % del AIU, siempre que sea mayor o igual a 4 UVT).","≥ 4 UVT","≥ 145.000",{"v":0.02,"d":"2.00%"}]
["Servicios de hoteles, restaurantes y hospedajes para obligados a declarar renta.","≥ 4","≥ 145.000",{"v":0.035,"d":"3.50%"}]
["Servicios de transporte nacional de carga.","≥ 4 UVT","≥ 145.000",{"v":0.01,"d":"1.00%"}]
{"$rows_left_out":8}
{"sheet":"2","index":14,"n_rows":23,"n_cols":4,"rows_kept":23,"hidden":true,"merged":[[5,0,8,3],[26,0,26,8],[27,0,27,8]]}
[]
[]
[]
[]
[]
["Material relacionado"]
[]
[]
[]
["Contenido","Cuantía en UVT","Cuantía en pesos","Tarifa"]
["Compras en general para obligados a declarar renta.","≥ 27 UVT","≥ 980.000",{"v":0.025,"d":"2.50%"}]
["Compras en general para no obligados a declarar renta.","≥ 27 UVT","≥ 980.000",{"v":0.035,"d":"3.50%"}]
["Compra de café pergamino o cereza.","> 160 UVT","> 5.809.000",{"v":0.005,"d":"0.50%"}]
["Compras con tarjetas débito o crédito.","No aplica","> 0",{"v":0.015,"d":"1.50%"}]
["Compra de productos agrícolas o pecuarios sin procesamiento industrial.","> 92 UVT","> 3.340.000",{"v":0.015,"d":"1.50%"}]
{"$rows_left_out":9}
{"sheet":"Formulas","index":15,"n_rows":3,"n_cols":1,"rows_kept":3,"hidden":true}
[]
[{"$f":"MOD((VALUE(MID(TEXT(Datos!F12,\"000000000000000\"),15,1))*3+VALUE(MID(TEXT(Datos!F12,\"000000000000000\"),14,1))*7+VALUE(MID(TEXT(Datos!F12,\"000000000000000\"),13,1))*13+VALUE(MID(TEXT(Datos!F12,\"000000000000000\"),12,1))*17+VALUE(MID(TEXT(Datos!F12,\"000000000000000\"),11,1))*19+VALUE(MID(TEXT(Datos!F12,\"000000000000000\"),10,1))*23+VALUE(MID(TEXT(Datos!F12,\"000000000000000\"),9,1))*29+VALUE(MID(TEXT(Datos!F12,\"000000000000000\"),8,1))*37+VALUE(MID(TEXT(Datos!F12,\"000000000000000\"),7,1))*41+VALUE(MID(TEXT(Datos!F12,\"000000000000000\"),6,1))*43+VALUE(MID(TEXT(Datos!F12,\"000000000000000\"),5,1))*47+VALUE(MID(TEXT(Datos!F12,\"000000000000000\"),4,1))*53+VALUE(MID(TEXT(Datos!F12,\"000000000000000\"),3,1))*59+VALUE(MID(TEXT(Datos!F12,\"000000000000000\"),2,1))*67+VALUE(MID(TEXT(Datos!F12,\"000000000000000\"),1,1))*71),11)","v":0}]
[{"$f":"MOD((VALUE(MID(TEXT(Datos!F29,\"000000000000000\"),15,1))*3+VALUE(MID(TEXT(Datos!F29,\"000000000000000\"),14,1))*7+VALUE(MID(TEXT(Datos!F29,\"000000000000000\"),13,1))*13+VALUE(MID(TEXT(Datos!F29,\"000000000000000\"),12,1))*17+VALUE(MID(TEXT(Datos!F29,\"000000000000000\"),11,1))*19+VALUE(MID(TEXT(Datos!F29,\"000000000000000\"),10,1))*23+VALUE(MID(TEXT(Datos!F29,\"000000000000000\"),9,1))*29+VALUE(MID(TEXT(Datos!F29,\"000000000000000\"),8,1))*37+VALUE(MID(TEXT(Datos!F29,\"000000000000000\"),7,1))*41+VALUE(MID(TEXT(Datos!F29,\"000000000000000\"),6,1))*43+VALUE(MID(TEXT(Datos!F29,\"000000000000000\"),5,1))*47+VALUE(MID(TEXT(Datos!F29,\"000000000000000\"),4,1))*53+VALUE(MID(TEXT(Datos!F29,\"000000000000000\"),3,1))*59+VALUE(MID(TEXT(Datos!F29,\"000000000000000\"),2,1))*67+VALUE(MID(TEXT(Datos!F29,\"000000000000000\"),1,1))*71),11)","v":0}]